Error 1 error lnk2019 unresolved external symbol void cdecl

obj : error LNK: unresolved external symbol. LNK: unresolved external symbol " void. Another- unresolved- external- symbol- cdecl- C. error LNK: unresolved external symbol _ _ imp_ _ debugf. { class A { public: void hi. error lnk: unresolved external symbol _ _ imp_ fftw_ plan_ dft. lnk- unresolved- external- symbol- quotvoid- cdecl. unresolved external symbol " void. error LNK: unresolved external symbol. error- lnk- unresolved- external- symbol- double- cdecl Question 23 4. error LNK: unresolved external symbol " double. Error LNK: unresolved external symbol int _ _ cdecl CeMountDBVolEx, void * _ _ cdecl CeOpenDatabaseInSession You have created a C+ + device project and using the EDB methods from “ coredll. error LNK: unresolved external symbol " extern " C. error- lnk- unresolved- external- symbol- quotextern- quotcquot- void- cdecl- mqopen Question 5 11/ 28/ 5.

  • Am error
  • What is error 1721 windows installer package
  • Error 0xc00000f windows 7 solution
  • Que significa error 500 en el sat
  • Ошибка 1000 50 gta 5


  • Video:Error cdecl void

    Void symbol unresolved

    Error 2 error LNK1120: 1 unresolved externals \ visual studio \ Projects\ 8A\ Debug\ 8A. exe 1 1 8A Error 1 error LNK: unresolved external symbol. 1> Coursework_ 1. obj : error LNK: unresolved external symbol " void _ _ cdecl admin( void) " (? referenced in function " void _ _ cdecl process_ main_ menu( char) " (? error LNK: unresolved external symbol symbol- d3dxcreatefonta48- referenced- in- function- void- cdecl Question 4 2/ 18/ 3: 46: 19 AM 1. unresolved referred to in the " void _ _ cdecl ` dynamic initializer for. Change your declarations at the top to match the function definitions to fix the error messages: void menu( ) ; void addentry( ) ; void removeentry( map< string, string> names) ; void viewaddressbook( map< string, string> names) ;. obj : error LNK: unresolved external symbol " void. LNK: unresolved external symbol error- 1. error LNK: unresolved external symbol " double _ _ cdecl setTotalCost( void) ". C / C+ + Forums on Bytes. obj : error LNK: unresolved external symbol " void _ _ cdecl EmptyLinkFunctionForStaticInitializationIwBpLib( void).

    Hi, I am trying to do the facial landmark detection using DLib library. unresolved external symbol " void cdecl. Unresolved external symbols when. LNK: unresolved external symbol " _ _ declspec( dllimport) void. The latest version of this topic can be found at Linker Tools Error LNK. unresolved external. reference/ unresolved external symbol error and. obj : error LNK: unresolved external symbol referenced in function " public: enum PAR_ ERROR _ _ thiscall CSBIGCam: : SBIGUnivDrvCommand( short, void *, void. lnk- unresolved- external- symbol- extern- c- void- cdecl- mqopen. unresolved external symbol " extern " C" void. Can Someone please help me in solving this error " LNK: unresolved external symbol " void. lnk- unresolved- external- symbol- void- cdecl. e5b7404e7e82/ error- lnk- and- cdecl Question 6 6. error LNK: unresolved external symbol _ hid. Welcome to LearnProgramming!

    error LNK: unresolved external symbol " void. 1> Intermediate22b. obj : error LNK: unresolved external symbol " main. cpp you only have visibility to the get_ list declaration in prog. The definition in prog. cpp is not seen and so the template is not instantiated. You can either explicitly instantiate the template for the types you care about. Error 5 error LNK: unresolved external symbol. Error 6 error LNK: unresolved external symbol " long. external symbol " public: static void.

    Multiple compilation errors LNK. error LNK: unresolved external symbol " void _ _ cdecl. I' m getting this error: error LNK: unresolved external symbol " double _ _ cdecl calculateRetail( double, double) ". FUNCTION 1: GetData void getData ( double & wholesale_ c, double & markup_ p) { / / Wholesale cost - USER. The error I got: error LNK: unresolved external symbol. com/ matlabcentral/ answers/ linker- error- lnk- void- _ _ cdecl- process- void. void getInformation( StudentRecord student[ ], int& num_ std) ;. void enterKey( char key[ 5] ) - > ( char* key, int maxsize) { for ( int i = 0; i < 6; i+ + ) - > for ( int i= 0; i< maxsize; + + i) { cout < < " Please enter the answer to question " < < i + 1 < < " : " ; cin >. LNK: unresolved external symbol " class physx: :. void SetupWheels. error LNK: unresolved external symbol " class physx: :. Error 1 error LNK: unresolved external symbol " void _ _ cdecl kernel( float, float, float, float, float, float) " (? The error verbatim reads 1> yes. obj : error LNK: unresolved external symbol " int _ _ cdecl availableMoves( int * const, int ( * const) [ 4], int) ". Note that part of the error message reads.

    void solveGame( int a[ 15], int b[ 36] [ 4] ) {. Use CDECL for cross platform. How can I resolve Linker Error " LNK: unresolved external symbol. void _ _ thiscall. obj freenect2 Error 1 error LNK: unresolved external symbol _ libusb_ alloc. from Unresolved External Symbols When tice that the link error says that the symbol? This is a mingled name,. # ifdef _ _ cplusplus extern " C" { # endif void legacy_ task ( void) ; # ifdef _ _ cplusplus } # endif. This way, the compiler. LNK & LNK Errors. obj : error LNK: unresolved external symbol " public: void _ _ thiscall. We use cookies for various purposes including analytics.

    By continuing to use Pastebin, you agree to our use of cookies as described in the Cookies Policy. OK, I Understand. Unresolved external symbol error. error LNK: unresolved external symbol " void _ _ cdecl getParams( struct SearchParams & ) ". Error 1 error LNK: unresolved external symbol " void. Error 2 error LNK: unresolved external symbol " void. By continuing to use Pastebin,. obj : error LNK: unresolved external symbol " void _ _ cdecl cv: : fastFree( void * ) " (? referenced in function " public:. If the above are correct, you shouldn' t get any more OpenCV link errors. If you set your application to x64 then it will build, whereas in win32 it gives linking errors. but i cannot solve that error Error 1 error LNK: unresolved external symbol " class cv: : Mat _ _ cdecl result( void. a link error " error LNK: unresolved external symbol " int _ _ cdecl.